Reaction Details
TargetRhodopsin kinase GRK1
LigandBDBM284001
Substrate/Competitorn/a
Meas. Tech.Assays for Inhibition of GRKs
pH7±n/a
IC50 14000±n/a nM
Commentsextracted
Citation Larsen, SDHoman, KWaldschmidt, HTesmer, JJ G protein-coupled receptor kinase 2 inhibitors and methods for use of the same US Patent US10023564 Publication Date 7/17/2018
 
Rhodopsin kinase GRK1
Name:Rhodopsin kinase GRK1
Type:PROTEIN
Mol. Mass.:63520.09
Organism:Homo sapiens (Human)
Description:ChEMBL_774378
Residue:563
BDBM284001
NameBDBM284001
Synonyms:E27 | US10023564, Example 27
TypeSmall organic molecule
Emp. Form.C29H27FN6O4
Mol. Mass.542.5609
SMILESCOc1ccccc1C(C)NC(=O)c1cc(ccc1F)C1NC(=O)NC(C)=C1C(=O)Nc1ccc2[nH]ncc2c1