Reaction Details
TargetRho-associated protein kinase 1
LigandBDBM50173324
Substrate/Competitorn/a
Meas. Tech.Assays for Inhibition of ROCK
IC50 200±n/a nM
Citation Larsen, SDHoman, KWaldschmidt, HTesmer, JJ G protein-coupled receptor kinase 2 inhibitors and methods for use of the same US Patent US10023564 Publication Date 7/17/2018
 
Rho-associated protein kinase 1
Name:Rho-associated protein kinase 1
Type:Serine/threonine-protein kinase
Mol. Mass.:158156.77
Organism:Homo sapiens (Human)
Description:Q13464
Residue:1354
BDBM50173324
NameBDBM50173324
Synonyms:CHEMBL3809124 | US10023564, Example 30
TypeSmall organic molecule
Emp. Form.C30H29FN6O5
Mol. Mass.572.5869
SMILESCOc1cccc(OC)c1CNC(=O)Cc1cc(ccc1F)C1NC(=O)NC(C)=C1C(=O)Nc1ccc2[nH]ncc2c1