Reaction Details
TargetG protein-coupled receptor kinase 5
LigandBDBM284005
Substrate/Competitorn/a
Meas. Tech.Assays for Inhibition of GRKs
pH7±n/a
IC50 10800±n/a nM
Commentsextracted
Citation Larsen, SDHoman, KWaldschmidt, HTesmer, JJ G protein-coupled receptor kinase 2 inhibitors and methods for use of the same US Patent US10023564 Publication Date 7/17/2018
 
G protein-coupled receptor kinase 5
Name:G protein-coupled receptor kinase 5
Type:PROTEIN
Mol. Mass.:67798.93
Organism:Homo sapiens (Human)
Description:ChEMBL_1280627
Residue:590
BDBM284005
NameBDBM284005
Synonyms:E31 | US10023564, Example 31
TypeSmall organic molecule
Emp. Form.C27H29FN6O5
Mol. Mass.536.5548
SMILESCC1=C(C(NC(=O)N1)c1ccc(F)c(CC(=O)N2CCOC(CCO)C2)c1)C(=O)Nc1ccc2[nH]ncc2c1