Reaction Details
TargetD(3) dopamine receptor
LigandBDBM50378001
Substrate/Competitorn/a
Meas. Tech.Binding Assay
Ki 0.26±n/a nM
Citation Newman, AHGrundt, PCyriac, GCLuedtke, RCao, J 4-phenylpiperazine derivatives with functionalized linkers as dopamine D3 receptor selective ligands and methods of use US Patent US8748608 Publication Date 6/10/2014
 
D(3) dopamine receptor
Name:D(3) dopamine receptor
Type:n/a
Mol. Mass.:44243.43
Organism:Homo sapiens (Human)
Description:n/a
Residue:400
BDBM50378001
NameBDBM50378001
Synonyms:CHEMBL1627321 | US8748608, 36
TypeSmall organic molecule
Emp. Form.C23H26Cl2N4O2
Mol. Mass.461.384
SMILESOC(CCN1CCN(CC1)c1cccc(Cl)c1Cl)CNC(=O)c1cc2ccccc2[nH]1