Reaction Details
TargetPhosphatidylinositol 4,5-bisphosphate 3-kinase catalytic subunit delta isoform
LigandBDBM50403098
Substrate/Competitorn/a
Meas. Tech.Alphascreen Assays
pH7±n/a
Ki 5±n/a nM
Commentsextracted
Citation Cushing, TDHao, XLohman, JWShin, Y Heterocyclic compounds and their uses US Patent US8754089 Publication Date 6/17/2014
 
Phosphatidylinositol 4,5-bisphosphate 3-kinase catalytic subunit delta isoform
Name:Phosphatidylinositol 4,5-bisphosphate 3-kinase catalytic subunit delta isoform
Type:Enzyme Subunit
Mol. Mass.:119489.41
Organism:Homo sapiens (Human)
Description:O00329
Residue:1044
BDBM50403098
NameBDBM50403098
Synonyms:CHEMBL2216893 | US8754089, 4-amino-6-(((1S)-1-(6-methyl-4-oxo-3-phenyl-4H-pyrido[1,2-a]pyrimidin-2-yl)ethyl)amino)-5-pyrimidinecarbonitrile
TypeSmall organic molecule
Emp. Form.C22H19N7O
Mol. Mass.397.4326
SMILESC[C@H](Nc1ncnc(N)c1C#N)c1nc2cccc(C)n2c(=O)c1-c1ccccc1