Reaction Details
TargetTyrosine-protein phosphatase non-receptor type 1
LigandBDBM124234
Substrate/Competitorn/a
Meas. Tech.pNPP assay
IC50 1.199e+4± 1.25e+3 nM
Citation Wang, WLHuang, CGao, LXTang, CLWang, JQWu, MCSheng, LChen, HJNan, FJLi, JYLi, JFeng, B Synthesis and biological evaluation of novel bis-aromatic amides as novel PTP1B inhibitors. Bioorg Med Chem Lett24:1889-94 (2014) 
 
Tyrosine-protein phosphatase non-receptor type 1
Name:Tyrosine-protein phosphatase non-receptor type 1
Type:Protein phosphatase
Mol. Mass.:49963.76
Organism:Homo sapiens (Human)
Description:Human recombinant GST-fusion PTP1B (1-435).
Residue:435
BDBM124234
NameBDBM124234
Synonyms:N,N'-(biphenyl-4,4'-diyl)dibenzamide (3)
TypeSmall organic molecule
Emp. Form.C26H20N2O2
Mol. Mass.392.4492
SMILESO=C(Nc1ccc(cc1)-c1ccc(NC(=O)c2ccccc2)cc1)c1ccccc1