Reaction Details
TargetTyrosine-protein phosphatase non-receptor type 1
LigandBDBM124248
Substrate/Competitorn/a
Meas. Tech.pNPP assay
IC50 5.37e+3± 5.6e+2 nM
Citation Wang, WLHuang, CGao, LXTang, CLWang, JQWu, MCSheng, LChen, HJNan, FJLi, JYLi, JFeng, B Synthesis and biological evaluation of novel bis-aromatic amides as novel PTP1B inhibitors. Bioorg Med Chem Lett24:1889-94 (2014) 
 
Tyrosine-protein phosphatase non-receptor type 1
Name:Tyrosine-protein phosphatase non-receptor type 1
Type:Protein phosphatase
Mol. Mass.:49963.76
Organism:Homo sapiens (Human)
Description:Human recombinant GST-fusion PTP1B (1-435).
Residue:435
BDBM124248
NameBDBM124248
Synonyms:N-(6-(4-benzamidophenyl)pyridin-3-yl)benzamide (28)
TypeSmall organic molecule
Emp. Form.C25H19N3O2
Mol. Mass.393.4373
SMILESO=C(Nc1ccc(cc1)-c1ccc(NC(=O)c2ccccc2)cn1)c1ccccc1