Reaction Details
TargetTyrosine-protein phosphatase non-receptor type 1
LigandBDBM124250
Substrate/Competitorn/a
Meas. Tech.pNPP assay
IC50 7.14e+3± 1.19e+3 nM
Citation Wang, WLHuang, CGao, LXTang, CLWang, JQWu, MCSheng, LChen, HJNan, FJLi, JYLi, JFeng, B Synthesis and biological evaluation of novel bis-aromatic amides as novel PTP1B inhibitors. Bioorg Med Chem Lett24:1889-94 (2014) 
 
Tyrosine-protein phosphatase non-receptor type 1
Name:Tyrosine-protein phosphatase non-receptor type 1
Type:Protein phosphatase
Mol. Mass.:49963.76
Organism:Homo sapiens (Human)
Description:Human recombinant GST-fusion PTP1B (1-435).
Residue:435
BDBM124250
NameBDBM124250
Synonyms:N-(6-(4-(cyclohexanecarboxamido)phenyl)pyridin-3-yl)cyclohexanecarboxamide (30)
TypeSmall organic molecule
Emp. Form.C25H31N3O2
Mol. Mass.405.5325
SMILESO=C(Nc1ccc(cc1)-c1ccc(NC(=O)C2CCCCC2)cn1)C1CCCCC1