Reaction Details
TargetTyrosine-protein phosphatase non-receptor type 2
LigandBDBM124238
Substrate/Competitorn/a
Meas. Tech.pNPP assay
IC50 2.119e+4± 1.16e+3 nM
Citation Wang, WLHuang, CGao, LXTang, CLWang, JQWu, MCSheng, LChen, HJNan, FJLi, JYLi, JFeng, B Synthesis and biological evaluation of novel bis-aromatic amides as novel PTP1B inhibitors. Bioorg Med Chem Lett24:1889-94 (2014) 
 
Tyrosine-protein phosphatase non-receptor type 2
Name:Tyrosine-protein phosphatase non-receptor type 2
Type:Protein
Mol. Mass.:48481.80
Organism:Homo sapiens (Human)
Description:P17706
Residue:415
BDBM124238
NameBDBM124238
Synonyms:di-tert-butyl4,4'-(([1,1'-biphenyl]-4,4'-diylbis(azanediyl))bis(carbonyl))bis(piperidine-1-carboxylate) (11)
TypeSmall organic molecule
Emp. Form.C34H46N4O6
Mol. Mass.606.7522
SMILESCC(C)(C)OC(=O)N1CCC(CC1)C(=O)Nc1ccc(cc1)-c1ccc(NC(=O)C2CCN(CC2)C(=O)OC(C)(C)C)cc1