Reaction Details
TargetTyrosine-protein phosphatase non-receptor type 1
LigandBDBM124257
Substrate/Competitorn/a
IC50 1.50e+3± 3.3e+2 nM
Citation Yin, JPTang, CLGao, LXMa, WPLi, JYLi, YLi, JNan, FJ Design and synthesis of paracaseolide A analogues as selective protein tyrosine phosphatase 1B inhibitors. Org Biomol Chem12:3441-5 (2014) 
 
Tyrosine-protein phosphatase non-receptor type 1
Name:Tyrosine-protein phosphatase non-receptor type 1
Type:Protein phosphatase
Mol. Mass.:49963.76
Organism:Homo sapiens (Human)
Description:Human recombinant GST-fusion PTP1B (1-435).
Residue:435
BDBM124257
NameBDBM124257
Synonyms:Paracaseolide A (13)
TypeSmall organic molecule
Emp. Form.C38H62O5
Mol. Mass.598.8959
SMILESCCCCCCCCCCCC\C=C\[C@@]12[C@H]3[C@H]4C(=C[C@H]1CCCCCCCCCCCC)C(=O)O[C@@]4(C)O[C@@]3(C)OC2=O