Reaction Details
TargetM-phase inducer phosphatase 2
LigandBDBM124253
Substrate/Competitorn/a
IC50 3.93e+3± 1.7e+2 nM
Citation Yin, JPTang, CLGao, LXMa, WPLi, JYLi, YLi, JNan, FJ Design and synthesis of paracaseolide A analogues as selective protein tyrosine phosphatase 1B inhibitors. Org Biomol Chem12:3441-5 (2014) 
 
M-phase inducer phosphatase 2
Name:M-phase inducer phosphatase 2
Type:Protein
Mol. Mass.:64985.27
Organism:Homo sapiens (Human)
Description:n/a
Residue:580
BDBM124253
NameBDBM124253
Synonyms:(1R,2S,3S,8R,9S,12S)-8-dodecyl-3,12-dimethyl-9-[(1E)-pentadec-1-en-1-yl]-4,11-dioxatricyclo[7.3.0.0,⁶]dodec-6-ene-5,10-dione (7)
TypeSmall organic molecule
Emp. Form.C39H66O4
Mol. Mass.598.9389
SMILESCCCCCCCCCCCCC\C=C\[C@]12[C@H]([C@H](C)OC1=O)[C@@H]1[C@H](C)OC(=O)C1=CC2CCCCCCCCCCCC