Reaction Details
TargetPhosphatidylinositol 4,5-bisphosphate 3-kinase catalytic subunit alpha isoform
LigandBDBM124675
Substrate/Competitorn/a
Meas. Tech.Alphascreen Assay
pH7±n/a
Ki 4.434±n/a nM
Commentsextracted
Citation Brown, MChen, YCushing, TDGonzalez Lopez De Turiso, FHe, XKohn, TJLohman, JWPattaropong, VSeganish, JShin, YSimard, JL Heterocyclic compounds and their uses US Patent US8765940 Publication Date 7/1/2014
 
Phosphatidylinositol 4,5-bisphosphate 3-kinase catalytic subunit alpha isoform
Name:Phosphatidylinositol 4,5-bisphosphate 3-kinase catalytic subunit alpha isoform
Type:Enzyme Subunit
Mol. Mass.:124294.87
Organism:Homo sapiens (Human)
Description:P42336
Residue:1068
BDBM124675
NameBDBM124675
Synonyms:US8765940, 4-(3,3-dimethyl-6-(4-morpholinyl)-2,3-dihydro-1H-indol-1-yl)-7-fluoro-3-methyl-2-(2-(methylsulfonyl)phenyl)quinoline
TypeSmall organic molecule
Emp. Form.C31H32FN3O3S
Mol. Mass.545.667
SMILESCc1c(nc2cc(F)ccc2c1N1CC(C)(C)c2ccc(cc12)N1CCOCC1)-c1ccccc1S(C)(=O)=O