Reaction Details
TargetPhosphatidylinositol 4,5-bisphosphate 3-kinase catalytic subunit alpha isoform
LigandBDBM124743
Substrate/Competitorn/a
Meas. Tech.Alphascreen Assay
pH7±n/a
Ki 2.34±n/a nM
Commentsextracted
Citation Brown, MChen, YCushing, TDGonzalez Lopez De Turiso, FHe, XKohn, TJLohman, JWPattaropong, VSeganish, JShin, YSimard, JL Heterocyclic compounds and their uses US Patent US8765940 Publication Date 7/1/2014
 
Phosphatidylinositol 4,5-bisphosphate 3-kinase catalytic subunit alpha isoform
Name:Phosphatidylinositol 4,5-bisphosphate 3-kinase catalytic subunit alpha isoform
Type:Enzyme Subunit
Mol. Mass.:124294.87
Organism:Homo sapiens (Human)
Description:P42336
Residue:1068
BDBM124743
NameBDBM124743
Synonyms:US8765940, 4-(3,3-dimethyl-6-(4-morpholinyl)-2,3-dihydro-1H-pyrrolo[3,2-b]pyridin-1-yl)-5,7-difluoro-2-(3-methoxybenzyl)-3-methylquinoline
TypeSmall organic molecule
Emp. Form.C31H32F2N4O2
Mol. Mass.530.6082
SMILESCOc1cccc(Cc2nc3cc(F)cc(F)c3c(N3CC(C)(C)c4ncc(cc34)N3CCOCC3)c2C)c1