Reaction Details
TargetPhosphatidylinositol 4,5-bisphosphate 3-kinase catalytic subunit alpha isoform
LigandBDBM124753
Substrate/Competitorn/a
Meas. Tech.Alphascreen Assay
pH7±n/a
Ki 6.48±n/a nM
Commentsextracted
Citation Brown, MChen, YCushing, TDGonzalez Lopez De Turiso, FHe, XKohn, TJLohman, JWPattaropong, VSeganish, JShin, YSimard, JL Heterocyclic compounds and their uses US Patent US8765940 Publication Date 7/1/2014
 
Phosphatidylinositol 4,5-bisphosphate 3-kinase catalytic subunit alpha isoform
Name:Phosphatidylinositol 4,5-bisphosphate 3-kinase catalytic subunit alpha isoform
Type:Enzyme Subunit
Mol. Mass.:124294.87
Organism:Homo sapiens (Human)
Description:P42336
Residue:1068
BDBM124753
NameBDBM124753
Synonyms:US8765940, 1'-(5-fluoro-3-methyl-2-(2-pyridinyl)-4-quinolinyl)-6'-(4-morpholinyl)-1',2,2',3,5,6-hexahydrospiro[pyran-4,3'-pyrrolo[3,2-b]pyridine]
TypeSmall organic molecule
Emp. Form.C30H30FN5O2
Mol. Mass.511.5899
SMILESCc1c(nc2cccc(F)c2c1N1CC2(CCOCC2)c2ncc(cc12)N1CCOCC1)-c1ccccn1