Reaction Details
TargetPhosphatidylinositol 4,5-bisphosphate 3-kinase catalytic subunit alpha isoform
LigandBDBM50403100
Substrate/Competitorn/a
Meas. Tech.Alphascreen Assay
pH7±n/a
Ki 1.05±n/a nM
Commentsextracted
Citation Brown, MChen, YCushing, TDGonzalez Lopez De Turiso, FHe, XKohn, TJLohman, JWPattaropong, VSeganish, JShin, YSimard, JL Heterocyclic compounds and their uses US Patent US8765940 Publication Date 7/1/2014
 
Phosphatidylinositol 4,5-bisphosphate 3-kinase catalytic subunit alpha isoform
Name:Phosphatidylinositol 4,5-bisphosphate 3-kinase catalytic subunit alpha isoform
Type:Enzyme Subunit
Mol. Mass.:124294.87
Organism:Homo sapiens (Human)
Description:P42336
Residue:1068
BDBM50403100
NameBDBM50403100
Synonyms:CHEMBL2216891 | US8765940, 4-(3,3-dimethyl-6-(4-morpholinyl)-2,3-dihydro-1H-pyrrolo[3,2-b]pyridin-1-yl)-5,7-difluoro-3-methyl-2-(5-methyl-2-(methylsulfonyl)phenyl)quinoline
TypeSmall organic molecule
Emp. Form.C31H32F2N4O3S
Mol. Mass.578.673
SMILESCc1ccc(c(c1)-c1nc2cc(F)cc(F)c2c(N2CC(C)(C)c3ncc(cc23)N2CCOCC2)c1C)S(C)(=O)=O