Reaction Details
TargetPhosphatidylinositol 4,5-bisphosphate 3-kinase catalytic subunit alpha isoform
LigandBDBM124796
Substrate/Competitorn/a
Meas. Tech.Alphascreen Assay
pH7±n/a
Ki 3.16±n/a nM
Commentsextracted
Citation Brown, MChen, YCushing, TDGonzalez Lopez De Turiso, FHe, XKohn, TJLohman, JWPattaropong, VSeganish, JShin, YSimard, JL Heterocyclic compounds and their uses US Patent US8765940 Publication Date 7/1/2014
 
Phosphatidylinositol 4,5-bisphosphate 3-kinase catalytic subunit alpha isoform
Name:Phosphatidylinositol 4,5-bisphosphate 3-kinase catalytic subunit alpha isoform
Type:Enzyme Subunit
Mol. Mass.:124294.87
Organism:Homo sapiens (Human)
Description:P42336
Residue:1068
BDBM124796
NameBDBM124796
Synonyms:US8765940, 4-(5,7-difluoro-3-methyl-4-(6'-(4-morpholinyl)-2,3,5,6-tetrahydrospiro[pyran-4,3'-pyrrolo[3,2-b]pyridin]-1'(2H)-yl)-2-quinolinyl)-N-methyl-1-piperazinecarboxamide
TypeSmall organic molecule
Emp. Form.C31H37F2N7O3
Mol. Mass.593.6674
SMILESCNC(=O)N1CCN(CC1)c1nc2cc(F)cc(F)c2c(N2CC3(CCOCC3)c3ncc(cc23)N2CCOCC2)c1C