Reaction Details
TargetProstaglandin D2 receptor 2
LigandBDBM124815
Substrate/Competitorn/a
Meas. Tech.Radioligand Binding Assay
pH7.4±n/a
Temperature298.15±n/a K
Ki 0.2±n/a nM
Commentsextracted
Citation Anderskewitz, RMartyres, DOost, TRist, WSeither, P Pyrazole compounds as CRTH2 antagonists US Patent US8759386 Publication Date 6/24/2014
 
Prostaglandin D2 receptor 2
Name:Prostaglandin D2 receptor 2
Type:Enzyme
Mol. Mass.:43295.45
Organism:Homo sapiens (Human)
Description:Q9Y5Y4
Residue:395
BDBM124815
NameBDBM124815
Synonyms:US8759386, 12
TypeSmall organic molecule
Emp. Form.C23H21FN4O3
Mol. Mass.420.4362
SMILESCc1nn(Cc2ccc(NC(=O)c3cc4cc(F)ccc4[nH]3)cc2)c(C)c1CC(O)=O