Reaction Details
TargetProstaglandin D2 receptor 2
LigandBDBM124817
Substrate/Competitorn/a
Meas. Tech.Radioligand Binding Assay
pH7.4±n/a
Temperature298.15±n/a K
Ki 0.1±n/a nM
Commentsextracted
Citation Anderskewitz, RMartyres, DOost, TRist, WSeither, P Pyrazole compounds as CRTH2 antagonists US Patent US8759386 Publication Date 6/24/2014
 
Prostaglandin D2 receptor 2
Name:Prostaglandin D2 receptor 2
Type:Enzyme
Mol. Mass.:43295.45
Organism:Homo sapiens (Human)
Description:Q9Y5Y4
Residue:395
BDBM124817
NameBDBM124817
Synonyms:US8759386, 14
TypeSmall organic molecule
Emp. Form.C25H26N4O4
Mol. Mass.446.4983
SMILESCOc1ccc2[nH]c(C(=O)Nc3ccc(Cn4nc(C)c(CC(O)=O)c4C)cc3)c(C)c2c1