Reaction Details
TargetProstaglandin D2 receptor 2
LigandBDBM124825
Substrate/Competitorn/a
Meas. Tech.Radioligand Binding Assay
pH7.4±n/a
Temperature298.15±n/a K
Ki 0.2±n/a nM
Commentsextracted
Citation Anderskewitz, RMartyres, DOost, TRist, WSeither, P Pyrazole compounds as CRTH2 antagonists US Patent US8759386 Publication Date 6/24/2014
 
Prostaglandin D2 receptor 2
Name:Prostaglandin D2 receptor 2
Type:Enzyme
Mol. Mass.:43295.45
Organism:Homo sapiens (Human)
Description:Q9Y5Y4
Residue:395
BDBM124825
NameBDBM124825
Synonyms:US8759386, 22
TypeSmall organic molecule
Emp. Form.C27H30N4O3
Mol. Mass.458.5521
SMILESCCc1nn(Cc2ccc(NC(=O)c3cc4ccccc4n3CC)cc2)c(CC)c1CC(O)=O