Reaction Details
TargetProstaglandin D2 receptor 2
LigandBDBM124838
Substrate/Competitorn/a
Meas. Tech.Radioligand Binding Assay
pH7.4±n/a
Temperature298.15±n/a K
Ki 0.3±n/a nM
Commentsextracted
Citation Anderskewitz, RMartyres, DOost, TRist, WSeither, P Pyrazole compounds as CRTH2 antagonists US Patent US8759386 Publication Date 6/24/2014
 
Prostaglandin D2 receptor 2
Name:Prostaglandin D2 receptor 2
Type:Enzyme
Mol. Mass.:43295.45
Organism:Homo sapiens (Human)
Description:Q9Y5Y4
Residue:395
BDBM124838
NameBDBM124838
Synonyms:US8759386, 35
TypeSmall organic molecule
Emp. Form.C25H23F2N3O4
Mol. Mass.467.4646
SMILESCCc1c(oc2c(F)cc(F)cc12)C(=O)Nc1ccc(Cn2nc(C)c(CC(O)=O)c2C)cc1