Reaction Details
TargetProstaglandin D2 receptor 2
LigandBDBM124852
Substrate/Competitorn/a
Meas. Tech.Radioligand Binding Assay
pH7.4±n/a
Temperature298.15±n/a K
Ki 0.1±n/a nM
Commentsextracted
Citation Anderskewitz, RMartyres, DOost, TRist, WSeither, P Pyrazole compounds as CRTH2 antagonists US Patent US8759386 Publication Date 6/24/2014
 
Prostaglandin D2 receptor 2
Name:Prostaglandin D2 receptor 2
Type:Enzyme
Mol. Mass.:43295.45
Organism:Homo sapiens (Human)
Description:Q9Y5Y4
Residue:395
BDBM124852
NameBDBM124852
Synonyms:US8759386, 49
TypeSmall organic molecule
Emp. Form.C25H24FN3O5
Mol. Mass.465.4736
SMILESCOc1ccc2oc(C(=O)Nc3ccc(Cn4nc(C)c(CC(O)=O)c4C)c(F)c3)c(C)c2c1