Reaction Details
TargetLysine-specific demethylase 5A
LigandBDBM50346586
Substrate/Competitorn/a
Meas. Tech.Biological Assay
pH7.5±n/a
Ki 20000±n/a nM
Commentsextracted
Citation Minucci, SMai, AMattevi, A Tranylcypromine derivatives as inhibitors of histone demethylases LSD1 and/or LSD2 US Patent US8765820 Publication Date 7/1/2014
 
Lysine-specific demethylase 5A
Name:Lysine-specific demethylase 5A
Type:Protein
Mol. Mass.:192210.15
Organism:Mus musculus (Mouse)
Description:Q3UXZ9
Residue:1690
BDBM50346586
NameBDBM50346586
Synonyms:CHEMBL1795981 | US8765820, 5a
TypeSmall organic molecule
Emp. Form.C17H18N2O2
Mol. Mass.282.337
SMILESNC1CC1c1ccc(NC(=O)OCc2ccccc2)cc1