Reaction Details
TargetNeuronal acetylcholine receptor subunit alpha-7
LigandBDBM125053
Substrate/Competitorn/a
Meas. Tech.Inhibition Assay
pH7.4±n/a
Temperature277.15±n/a K
Ki<1.00±n/a nM
Citation Fleβner, TBöβ, FErb, CHafner, FSchnizler, KLang, DLuithle, JVan Kampen, MVan der Staay, F Azabicyclic carbamates and their use as alpha-7 nicotinic acetylcholine receptor agonists US Patent US8772511 Publication Date 7/8/2014
 
Neuronal acetylcholine receptor subunit alpha-7
Name:Neuronal acetylcholine receptor subunit alpha-7
Type:Enzyme
Mol. Mass.:56502.44
Organism:Rattus norvegicus (Rat)
Description:Q05941
Residue:502
BDBM125053
NameBDBM125053
Synonyms:US8772511, 22
TypeSmall organic molecule
Emp. Form.C24H26N4O4
Mol. Mass.434.4876
SMILESCOc1ccc(NC(=O)Nc2ccc3cc(oc3c2)C(=O)N[C@H]2CN3CCC2CC3)cc1