Reaction Details
TargetMitogen-activated protein kinase 14
LigandBDBM125210
Substrate/Competitorn/a
Meas. Tech.Biological Assay
pH7.5±n/a
IC50 0.3±n/a nM
Commentsextracted
Citation Tasker, APettus, LHWurz, R Aza- and diaza-phthalazine compounds as P38 map kinase modulators and methods of use thereof US Patent US8772481 Publication Date 7/8/2014
 
Mitogen-activated protein kinase 14
Name:Mitogen-activated protein kinase 14
Type:Serine/threonine-protein kinase
Mol. Mass.:41286.76
Organism:Homo sapiens (Human)
Description:Q16539
Residue:360
BDBM125210
NameBDBM125210
Synonyms:US8772481, 10
TypeSmall organic molecule
Emp. Form.C19H10F4N4
Mol. Mass.370.3031
SMILESFc1ccc(Nc2ccc3c(nncc3n2)-c2ccc(F)cc2F)c(F)c1