Reaction Details
TargetPhosphatidylinositol 4,5-bisphosphate 3-kinase catalytic subunit alpha isoform
LigandBDBM125504
Substrate/Competitorn/a
Meas. Tech.Alphascreen Assay
Ki 6±n/a nM
Citation Andrews, KLBo, YYBooker, SCee, VJD'Angelo, NHerberich, BJHong, FJackson, CLLanman, BALiao, HLiu, LNishimura, NNorman, MHPettus, LHReed, ABSmith, ALTadesse, STamayo, NAWu, BWurz, RYang, KC Inhibitors of PI3 kinase and/or mTOR US Patent US8772480 Publication Date 7/8/2014
 
Phosphatidylinositol 4,5-bisphosphate 3-kinase catalytic subunit alpha isoform
Name:Phosphatidylinositol 4,5-bisphosphate 3-kinase catalytic subunit alpha isoform
Type:Enzyme Subunit
Mol. Mass.:124294.87
Organism:Homo sapiens (Human)
Description:P42336
Residue:1068
BDBM125504
NameBDBM125504
Synonyms:US8772480, 373
TypeSmall organic molecule
Emp. Form.C22H29ClN10O3S
Mol. Mass.549.049
SMILESC[C@@H](N1CCOCC1)c1cnc(Nc2cnc(Cl)c(NS(=O)(=O)N(C)C)c2)c(c1)-c1nc(C)nc(N)n1