Reaction Details
TargetSerine/threonine-protein kinase mTOR
LigandBDBM125322
Substrate/Competitorn/a
Meas. Tech.In Vitro Inhibition Assay
IC50>10000±n/a nM
Citation Andrews, KLBo, YYBooker, SCee, VJD'Angelo, NHerberich, BJHong, FJackson, CLLanman, BALiao, HLiu, LNishimura, NNorman, MHPettus, LHReed, ABSmith, ALTadesse, STamayo, NAWu, BWurz, RYang, KC Inhibitors of PI3 kinase and/or mTOR US Patent US8772480 Publication Date 7/8/2014
 
Serine/threonine-protein kinase mTOR
Name:Serine/threonine-protein kinase mTOR
Type:Rapamycin target protein
Mol. Mass.:288917.12
Organism:Homo sapiens (Human)
Description:P42345
Residue:2549
BDBM125322
NameBDBM125322
Synonyms:US8772480, 142
TypeSmall organic molecule
Emp. Form.C23H22FN7O3S
Mol. Mass.495.529
SMILESCOc1ncc(Nc2ncc(Cc3ccc(cc3)S(C)(=O)=O)cc2-c2nc(C)nc(N)n2)cc1F