Reaction Details
TargetMitogen-activated protein kinase 14
LigandBDBM50352566
Substrate/Competitorn/a
Meas. Tech.Inhibition Assay
pH7.5±n/a
Temperature298.15±n/a K
IC50 0.06±n/a nM
Citation Eastwood, PRGonzalez Rodriguez, JVidal Juan, BAguilar Izquierdo, N Substituted spiro[cycloalkyl-1,3′-indo]-2′(1′H)-one derivatives and their use as P38 mitogen-activated kinase inhibitors US Patent US8772288 Publication Date 7/8/2014
 
Mitogen-activated protein kinase 14
Name:Mitogen-activated protein kinase 14
Type:Serine/threonine-protein kinase
Mol. Mass.:41286.76
Organism:Homo sapiens (Human)
Description:Q16539
Residue:360
BDBM50352566
NameBDBM50352566
Synonyms:CHEMBL1825148 | US8772288, 23
TypeSmall organic molecule
Emp. Form.C23H21N3O4
Mol. Mass.403.4305
SMILESCc1ccc(cc1-c1ccc2c(NC(=O)C22CCOCC2)c1)C(=O)Nc1ccon1