Reaction Details
TargetGag-Pol polyprotein
LigandBDBM126686
Substrate/Competitorn/a
Meas. Tech.Alphascreen Assay
pH7.4±n/a
Temperature277.15±n/a K
IC50 11740±n/a nM
Citation Bardiot, DChaltin, PChrist, FDebyser, ZDe Maeyer, MMarchand, AMarchand, DVoet, A Thieno [2, 3-B] pyridine derivatives as viral replication inhibitors US Patent US8785638 Publication Date 7/22/2014
 
Gag-Pol polyprotein
Name:Gag-Pol polyprotein
Type:Protein
Mol. Mass.:163312.58
Organism:Human immunodeficiency virus type 1 (HIV-1)
Description:P03367
Residue:1447
BDBM126686
NameBDBM126686
Synonyms:US8785638, 177
TypeSmall organic molecule
Emp. Form.C22H27N3O3S
Mol. Mass.413.533
SMILESCc1nc2sc3CCCCc3c2c(-c2cnn(C)c2)c1C(OC(C)(C)C)C(O)=O