Reaction Details
TargetSodium-dependent serotonin transporter
LigandBDBM126700
Substrate/Competitorn/a
Meas. Tech.Receptor Binding Assay
Temperature298.15±n/a K
Ki 6.5±n/a nM
Commentsextracted
Citation Toyoda, TNishida, TYoshinaga, H Benzyl piperidine compound US Patent US8778970 Publication Date 7/15/2014
 
Sodium-dependent serotonin transporter
Name:Sodium-dependent serotonin transporter
Type:Multi-pass membrane protein
Mol. Mass.:70322.51
Organism:Homo sapiens (Human)
Description:P31645
Residue:630
BDBM126700
NameBDBM126700
Synonyms:US8778970, 5-8
TypeSmall organic molecule
Emp. Form.C23H26BrNO3
Mol. Mass.444.361
SMILESOc1cc(CC2CCN(CCc3ccc4OCCC(=O)c4c3)CC2)ccc1Br