Reaction Details
Target5-hydroxytryptamine receptor 1A
LigandBDBM126695
Substrate/Competitorn/a
Meas. Tech.Receptor Binding Assay
Temperature298.15±n/a K
Ki 7.4±n/a nM
Commentsextracted
Citation Toyoda, TNishida, TYoshinaga, H Benzyl piperidine compound US Patent US8778970 Publication Date 7/15/2014
 
5-hydroxytryptamine receptor 1A
Name:5-hydroxytryptamine receptor 1A
Type:n/a
Mol. Mass.:46122.49
Organism:Homo sapiens (Human)
Description:n/a
Residue:422
BDBM126695
NameBDBM126695
Synonyms:US8778970, 5-3
TypeSmall organic molecule
Emp. Form.C26H33BrClNO5
Mol. Mass.554.901
SMILESCl.COCCOc1cc(CC2CCN(CCc3ccc4OCC(O)C(=O)c4c3)CC2)ccc1Br