Reaction Details
Target5-hydroxytryptamine receptor 1A
LigandBDBM126698
Substrate/Competitorn/a
Meas. Tech.Receptor Binding Assay
Temperature298.15±n/a K
Ki 2±n/a nM
Commentsextracted
Citation Toyoda, TNishida, TYoshinaga, H Benzyl piperidine compound US Patent US8778970 Publication Date 7/15/2014
 
5-hydroxytryptamine receptor 1A
Name:5-hydroxytryptamine receptor 1A
Type:n/a
Mol. Mass.:46122.49
Organism:Homo sapiens (Human)
Description:n/a
Residue:422
BDBM126698
NameBDBM126698
Synonyms:US8778970, 5-6
TypeSmall organic molecule
Emp. Form.C26H31BrClNO4
Mol. Mass.536.886
SMILESCl.COCCOc1cc(CC2CCN(CCc3ccc4occc(=O)c4c3)CC2)ccc1Br