Reaction Details
Target5-hydroxytryptamine receptor 1A
LigandBDBM126704
Substrate/Competitorn/a
Meas. Tech.Receptor Binding Assay
Temperature298.15±n/a K
Ki 91±n/a nM
Commentsextracted
Citation Toyoda, TNishida, TYoshinaga, H Benzyl piperidine compound US Patent US8778970 Publication Date 7/15/2014
 
5-hydroxytryptamine receptor 1A
Name:5-hydroxytryptamine receptor 1A
Type:n/a
Mol. Mass.:46122.49
Organism:Homo sapiens (Human)
Description:n/a
Residue:422
BDBM126704
NameBDBM126704
Synonyms:US8778970, 4-10
TypeSmall organic molecule
Emp. Form.C25H29BrClNO6
Mol. Mass.554.858
SMILESCl.OC1COc2ccc(CCN3CCC(Cc4ccc(Br)c(OCC(O)=O)c4)CC3)cc2C1=O