Reaction Details
TargetCytochrome P450 2D6
LigandBDBM126698
Substrate/Competitorn/a
Meas. Tech.Inhibition Assay
IC50 28300±n/a nM
Citation Toyoda, TNishida, TYoshinaga, H Benzyl piperidine compound US Patent US8778970 Publication Date 7/15/2014
 
Cytochrome P450 2D6
Name:Cytochrome P450 2D6
Type:Protein
Mol. Mass.:55774.82
Organism:Homo sapiens (Human)
Description:P10635
Residue:497
BDBM126698
NameBDBM126698
Synonyms:US8778970, 5-6
TypeSmall organic molecule
Emp. Form.C26H31BrClNO4
Mol. Mass.536.886
SMILESCl.COCCOc1cc(CC2CCN(CCc3ccc4occc(=O)c4c3)CC2)ccc1Br