Reaction Details
TargetcAMP and cAMP-inhibited cGMP 3',5'-cyclic phosphodiesterase 10A
LigandBDBM126828
Substrate/Competitorn/a
Meas. Tech.Fluorescence Polarization Assay
Ki 0.019±n/a nM
Citation Cox, CDRaheem, ITShipe, WDTheberge, CR Alkoxy pyrimidine PDE10 inhibitors US Patent US8785467 Publication Date 7/22/2014
 
cAMP and cAMP-inhibited cGMP 3',5'-cyclic phosphodiesterase 10A
Name:cAMP and cAMP-inhibited cGMP 3',5'-cyclic phosphodiesterase 10A
Type:Protein
Mol. Mass.:88412.52
Organism:Homo sapiens (Human)
Description:Q9Y233
Residue:1055
BDBM126828
NameBDBM126828
Synonyms:US8785467, 1-37
TypeSmall organic molecule
Emp. Form.C22H22ClN7O
Mol. Mass.435.909
SMILESCc1c(Cl)nc(OC[C@@H]2C[C@H]2c2ccc3ncccc3n2)nc1NCc1cnn(C)c1