Reaction Details
TargetcAMP and cAMP-inhibited cGMP 3',5'-cyclic phosphodiesterase 10A
LigandBDBM126831
Substrate/Competitorn/a
Meas. Tech.Fluorescence Polarization Assay
Ki 0.17±n/a nM
Citation Cox, CDRaheem, ITShipe, WDTheberge, CR Alkoxy pyrimidine PDE10 inhibitors US Patent US8785467 Publication Date 7/22/2014
 
cAMP and cAMP-inhibited cGMP 3',5'-cyclic phosphodiesterase 10A
Name:cAMP and cAMP-inhibited cGMP 3',5'-cyclic phosphodiesterase 10A
Type:Protein
Mol. Mass.:88412.52
Organism:Homo sapiens (Human)
Description:Q9Y233
Residue:1055
BDBM126831
NameBDBM126831
Synonyms:US8785467, 1-40
TypeSmall organic molecule
Emp. Form.C23H25N7O2
Mol. Mass.431.4903
SMILESCOc1nc(OC[C@H]2C[C@@H]2c2ccc3ncccc3n2)nc(NCc2cnn(C)c2)c1C