Reaction Details
TargetcAMP and cAMP-inhibited cGMP 3',5'-cyclic phosphodiesterase 10A
LigandBDBM126836
Substrate/Competitorn/a
Meas. Tech.Fluorescence Polarization Assay
Ki 0.058±n/a nM
Citation Cox, CDRaheem, ITShipe, WDTheberge, CR Alkoxy pyrimidine PDE10 inhibitors US Patent US8785467 Publication Date 7/22/2014
 
cAMP and cAMP-inhibited cGMP 3',5'-cyclic phosphodiesterase 10A
Name:cAMP and cAMP-inhibited cGMP 3',5'-cyclic phosphodiesterase 10A
Type:Protein
Mol. Mass.:88412.52
Organism:Homo sapiens (Human)
Description:Q9Y233
Residue:1055
BDBM126836
NameBDBM126836
Synonyms:US8785467, 1-45
TypeSmall organic molecule
Emp. Form.C23H24N6OS
Mol. Mass.432.541
SMILESCc1nc(C)c(CNc2nc(OC[C@H]3C[C@@H]3c3ccc4ncccc4n3)ncc2C)s1