Reaction Details
TargetSphingosine 1-phosphate receptor 1
LigandBDBM127572
Substrate/Competitorn/a
Meas. Tech.Receptor Calcium FLIPR Antagonist Assay
Temperature310.15±n/a K
IC50 0.1±n/a nM
Commentsextracted
Citation Angst, DBollbuck, BJanser, PQuancard, JStiefl, NJ Aryl benzylamine compounds US Patent US8791100 Publication Date 7/29/2014
 
Sphingosine 1-phosphate receptor 1
Name:Sphingosine 1-phosphate receptor 1
Type:Enzyme
Mol. Mass.:42836.02
Organism:Homo sapiens (Human)
Description:P21453
Residue:382
BDBM127572
NameBDBM127572
Synonyms:US8791100, 70
TypeSmall organic molecule
Emp. Form.C21H22ClF3N2O2
Mol. Mass.426.86
SMILESCc1ccc(N[C@@H](c2ccc(Cl)c(C)c2)C(F)(F)F)cc1CN1CC(C1)C(O)=O