Reaction Details
TargetSphingosine 1-phosphate receptor 1
LigandBDBM127573
Substrate/Competitorn/a
Meas. Tech.Receptor Calcium FLIPR Antagonist Assay
Temperature310.15±n/a K
IC50 0.1±n/a nM
Commentsextracted
Citation Angst, DBollbuck, BJanser, PQuancard, JStiefl, NJ Aryl benzylamine compounds US Patent US8791100 Publication Date 7/29/2014
 
Sphingosine 1-phosphate receptor 1
Name:Sphingosine 1-phosphate receptor 1
Type:Enzyme
Mol. Mass.:42836.02
Organism:Homo sapiens (Human)
Description:P21453
Residue:382
BDBM127573
NameBDBM127573
Synonyms:US8791100, 71
TypeSmall organic molecule
Emp. Form.C20H19ClF4N2O2
Mol. Mass.430.824
SMILESCc1cc(ccc1Cl)[C@H](Nc1ccc(F)c(CN2CC(C2)C(O)=O)c1)C(F)(F)F