Reaction Details
TargetcAMP and cAMP-inhibited cGMP 3',5'-cyclic phosphodiesterase 10A
LigandBDBM127920
Substrate/Competitorn/a
Meas. Tech.Inhibition Assay
Temperature298.15±n/a K
IC50 0.4±n/a nM
Commentsextracted
Citation Kehler, JNielsen, JMarigo, MKilburn, JPLanggård, M Tricyclic imidazole compounds as PDE10 inhibitors US Patent US8796304 Publication Date 8/5/2014
 
cAMP and cAMP-inhibited cGMP 3',5'-cyclic phosphodiesterase 10A
Name:cAMP and cAMP-inhibited cGMP 3',5'-cyclic phosphodiesterase 10A
Type:Protein
Mol. Mass.:88412.52
Organism:Homo sapiens (Human)
Description:Q9Y233
Residue:1055
BDBM127920
NameBDBM127920
Synonyms:US8796304, 2-[2-(5,8-Bis(trideuteromethyl)-[1,2,4]triazolo[1,5-a]pyrazin-2-yl)-ethyl]-5,5-dideutero-5H-imidazo[2,1-a]isoindole | US8796304, 2-[2-(5,8-Dimethyl-[1,2,4]triazolo[1,5-a]pyrazin-2-yl)-ethyl]-5H-imidazo[2,1-a]isoindole
TypeSmall organic molecule
Emp. Form.C19H18N6
Mol. Mass.330.3864
SMILESCc1cnc(C)c2nc(CCc3cn4Cc5ccccc5-c4n3)nn12