Reaction Details
TargetTyrosine-protein kinase SYK
LigandBDBM127952
Substrate/Competitorn/a
Meas. Tech.Homogeneous Time-Resolved Fluorescence Assay
pH7.5±n/a
IC50<0.50±n/a nM
Commentsextracted
Citation Romeo, ETMachacek, MRTrotter, BWMiller, TAAndresen, BMAnthony, NJTaoka, BMLiu, Y Amino-pyridine-containing spleen tyrosine kinase (SYK) inhibitors US Patent US8796310 Publication Date 8/5/2014
 
Tyrosine-protein kinase SYK
Name:Tyrosine-protein kinase SYK
Type:Enzyme
Mol. Mass.:72079.99
Organism:Homo sapiens (Human)
Description:P43405
Residue:635
BDBM127952
NameBDBM127952
Synonyms:US8796310, 1U
TypeSmall organic molecule
Emp. Form.C28H26N4O3S
Mol. Mass.498.596
SMILESCc1cc(Nc2cc(ccn2)C2CC2)nc(c1)-c1cnc(s1)C1(O)CCCc2cc(ccc12)C(O)=O