Reaction Details
TargetTyrosine-protein kinase SYK
LigandBDBM127993
Substrate/Competitorn/a
Meas. Tech.Homogeneous Time-Resolved Fluorescence Assay
pH7.5±n/a
IC50<0.50±n/a nM
Commentsextracted
Citation Romeo, ETMachacek, MRTrotter, BWMiller, TAAndresen, BMAnthony, NJTaoka, BMLiu, Y Amino-pyridine-containing spleen tyrosine kinase (SYK) inhibitors US Patent US8796310 Publication Date 8/5/2014
 
Tyrosine-protein kinase SYK
Name:Tyrosine-protein kinase SYK
Type:Enzyme
Mol. Mass.:72079.99
Organism:Homo sapiens (Human)
Description:P43405
Residue:635
BDBM127993
NameBDBM127993
Synonyms:US8796310, 22
TypeSmall organic molecule
Emp. Form.C27H24F3N5O4S2
Mol. Mass.603.636
SMILESCc1cc(Nc2cc(ccn2)C(F)(F)F)nc(c1)-c1cnc(s1)[C@@]1(O)CCCc2cc(ccc12)C(=O)NS(C)(=O)=O