Reaction Details
TargetRNA-editing ligase 1, mitochondrial
LigandBDBM34905
Substrate/Competitorn/a
Meas. Tech.Fluorescence-based biochemical high throughput dose response assay to identify inhibitors of Trypanosoma brucei RNA editing ligase 1 (TbREL1).
IC50 494.22±n/a nM
Citation PubChem, PC Fluorescence-based biochemical high throughput dose response assay to identify inhibitors of Trypanosoma brucei RNA editing ligase 1 (TbREL1). PubChem Bioassay(2014)[AID]
 
RNA-editing ligase 1, mitochondrial
Name:RNA-editing ligase 1, mitochondrial
Type:Enzyme Catalytic Domain
Mol. Mass.:52299.36
Organism:Trypanosoma brucei brucei
Description:gi_342179211
Residue:469
BDBM34905
NameBDBM34905
Synonyms:1,6-dimethyl-3-propyl-pyrimido[5,4-e][1,2,4]triazine-5,7-dione 1,6-dimethyl-3-propylpyrimido[5,4-e][1,2,4]triazine-5,7-dione SMR000291200 cid_3164059
TypeSmall organic molecule
Emp. Form.C10H13N5O2
Mol. Mass.235.2425
SMILESCCCc1nn(C)c2nc(=O)n(C)c(=O)c2n1