Reaction Details
TargetAdenosine receptor A2a
LigandBDBM128299
Substrate/Competitorn/a
Meas. Tech.Competition Radioligand Binding Assay
Temperature298.15±n/a K
Ki 18±n/a nM
Commentsextracted
Citation Camacho Gomez, JACastro-Palomino Laria, JC 4-aminopyrimidine derivatives and their as as adenosine A2a receptor antagonists US Patent US8796284 Publication Date 8/5/2014
 
Adenosine receptor A2a
Name:Adenosine receptor A2a
Type:G Protein-Coupled Receptor (GPCR)
Mol. Mass.:44716.46
Organism:Homo sapiens (Human)
Description:P29274
Residue:412
BDBM128299
NameBDBM128299
Synonyms:US8796284, 8
TypeSmall organic molecule
Emp. Form.C10H11BrN6
Mol. Mass.295.139
SMILESNc1nc(nc(NC2CC2)c1Br)-n1cccn1