Reaction Details
TargetAdenosine receptor A2a
LigandBDBM128302
Substrate/Competitorn/a
Meas. Tech.Competition Radioligand Binding Assay
Temperature298.15±n/a K
Ki 35±n/a nM
Commentsextracted
Citation Camacho Gomez, JACastro-Palomino Laria, JC 4-aminopyrimidine derivatives and their as as adenosine A2a receptor antagonists US Patent US8796284 Publication Date 8/5/2014
 
Adenosine receptor A2a
Name:Adenosine receptor A2a
Type:G Protein-Coupled Receptor (GPCR)
Mol. Mass.:44716.46
Organism:Homo sapiens (Human)
Description:P29274
Residue:412
BDBM128302
NameBDBM128302
Synonyms:US8796284, 13
TypeSmall organic molecule
Emp. Form.C9H11BrN6
Mol. Mass.283.128
SMILESCN(C)c1nc(nc(N)c1Br)-n1cccn1