Reaction Details
TargetProstaglandin D2 receptor 2
LigandBDBM50397656
Substrate/Competitorn/a
Meas. Tech.Radioligand Binding Assay
pH7.4±n/a
Temperature298.15±n/a K
Ki 380±n/a nM
Commentsextracted
Citation Page, PSchwarz, MSebille, ECleva, CMerlot, CMaio, M 2,3-disubstituted pyrazinesulfonamides as CRTH2 inhibitors US Patent US8796280 Publication Date 8/5/2014
 
Prostaglandin D2 receptor 2
Name:Prostaglandin D2 receptor 2
Type:Enzyme
Mol. Mass.:43295.45
Organism:Homo sapiens (Human)
Description:Q9Y5Y4
Residue:395
BDBM50397656
NameBDBM50397656
Synonyms:CHEMBL2181745 | US8796280, 17
TypeSmall organic molecule
Emp. Form.C25H20F4N4O2S
Mol. Mass.516.511
SMILESCN(Cc1ccc(cc1)-c1nccnc1NS(=O)(=O)c1ccccc1C(F)(F)F)c1ccc(F)cc1