Reaction Details
TargetMitogen-activated protein kinase kinase kinase 5
LigandBDBM128393
Substrate/Competitorn/a
Meas. Tech.Scintillation Assay
pH7.5±n/a
Temperature298.15±n/a K
IC50 81±n/a nM
Commentsextracted
Citation Chang, E Apoptosis signal-regulating kinase 1 inhibitors US Patent US8802695 Publication Date 8/12/2014
 
Mitogen-activated protein kinase kinase kinase 5
Name:Mitogen-activated protein kinase kinase kinase 5
Type:Protein
Mol. Mass.:154514.93
Organism:Homo sapiens (Human)
Description:Q99683
Residue:1374
BDBM128393
NameBDBM128393
Synonyms:US8802695, 9
TypeSmall organic molecule
Emp. Form.C21H23N3O2
Mol. Mass.349.4262
SMILESCC(C)(O)c1ccc(cc1)C(=O)Nc1cc2n(CC3CC3)ccc2cn1