Reaction Details
TargetMitogen-activated protein kinase kinase kinase 5
LigandBDBM128397
Substrate/Competitorn/a
Meas. Tech.Homogeneous Time-Resolved Fluorescence Assay
pH7.3±n/a
Temperature298.15±n/a K
IC50 64±n/a nM
Commentsextracted
Citation Chang, E Apoptosis signal-regulating kinase 1 inhibitors US Patent US8802695 Publication Date 8/12/2014
 
Mitogen-activated protein kinase kinase kinase 5
Name:Mitogen-activated protein kinase kinase kinase 5
Type:Protein
Mol. Mass.:154514.93
Organism:Homo sapiens (Human)
Description:Q99683
Residue:1374
BDBM128397
NameBDBM128397
Synonyms:US8802695, 13
TypeSmall organic molecule
Emp. Form.C19H21N3O3
Mol. Mass.339.3883
SMILESCCn1ccc2cnc(NC(=O)c3ccc(cc3)[C@@](C)(O)CO)cc12