Reaction Details
TargetMitogen-activated protein kinase kinase kinase 5
LigandBDBM128400
Substrate/Competitorn/a
Meas. Tech.Homogeneous Time-Resolved Fluorescence Assay
pH7.3±n/a
Temperature298.15±n/a K
IC50 20±n/a nM
Commentsextracted
Citation Chang, E Apoptosis signal-regulating kinase 1 inhibitors US Patent US8802695 Publication Date 8/12/2014
 
Mitogen-activated protein kinase kinase kinase 5
Name:Mitogen-activated protein kinase kinase kinase 5
Type:Protein
Mol. Mass.:154514.93
Organism:Homo sapiens (Human)
Description:Q99683
Residue:1374
BDBM128400
NameBDBM128400
Synonyms:US8802695, 16
TypeSmall organic molecule
Emp. Form.C18H18BrN3O3
Mol. Mass.404.258
SMILESCn1cc(Br)c2cnc(NC(=O)c3ccc(cc3)[C@@](C)(O)CO)cc12