Reaction Details
TargetMitogen-activated protein kinase kinase kinase 5
LigandBDBM128405
Substrate/Competitorn/a
Meas. Tech.Homogeneous Time-Resolved Fluorescence Assay
pH7.3±n/a
Temperature298.15±n/a K
IC50 12446±n/a nM
Commentsextracted
Citation Chang, E Apoptosis signal-regulating kinase 1 inhibitors US Patent US8802695 Publication Date 8/12/2014
 
Mitogen-activated protein kinase kinase kinase 5
Name:Mitogen-activated protein kinase kinase kinase 5
Type:Protein
Mol. Mass.:154514.93
Organism:Homo sapiens (Human)
Description:Q99683
Residue:1374
BDBM128405
NameBDBM128405
Synonyms:US8802695, 21
TypeSmall organic molecule
Emp. Form.C19H21N3O4S
Mol. Mass.387.453
SMILESCC(C)(O)c1ccc(cc1)C(=O)Nc1cc2n(CS(C)(=O)=O)ccc2cn1