Reaction Details
TargetMitogen-activated protein kinase kinase kinase 5
LigandBDBM128407
Substrate/Competitorn/a
Meas. Tech.Homogeneous Time-Resolved Fluorescence Assay
pH7.3±n/a
Temperature298.15±n/a K
IC50 6±n/a nM
Commentsextracted
Citation Chang, E Apoptosis signal-regulating kinase 1 inhibitors US Patent US8802695 Publication Date 8/12/2014
 
Mitogen-activated protein kinase kinase kinase 5
Name:Mitogen-activated protein kinase kinase kinase 5
Type:Protein
Mol. Mass.:154514.93
Organism:Homo sapiens (Human)
Description:Q99683
Residue:1374
BDBM128407
NameBDBM128407
Synonyms:US8802695, 23
TypeSmall organic molecule
Emp. Form.C20H20ClN3O3
Mol. Mass.385.844
SMILESC[C@](O)(CO)c1ccc(cc1)C(=O)Nc1cc2n(cc(Cl)c2cn1)C1CC1